{"text_format":"1","workbook":"xlsx","n_sheets":10,"sheets":["Boys 10 Si Main","Girls 10 Si Main","Boys 12 Si MD","Girls 12 Si MD","Boys 14 Si Main","Girls 14 Si Main","Boys 16 Si Main","Girls Si Main 16","Boys 18 Si Main","Girls 18 Si Main"],"not_rendered":{"charts":0,"images":2,"macros":0,"external_links":4,"defined_names":284,"comments":10,"pivot_tables":0},"unopened":[],"bounds":{"document_bytes":16777216,"sheet_cells":100000,"rows_first":2000,"rows_last":500,"rows_between":2000,"halvings":0,"cell_chars":16384,"cell_head_chars":4096},"cells_cut":0,"cells_raw":0,"read":"whole","date_system":"1900"}

{"sheet":"Boys 10 Si Main","index":0,"n_rows":31,"n_cols":20,"rows_kept":31,"cut":false,"hidden":false,"merged":[[3,0,3,2]]}
[{"$f":"'[1]Week SetUp'!$A$6","v":"Sagicor Junior Tennis Tournament 2015"},null,null,null,null,null,null,null,null,null,null,null,null,""]
[null,null,null,null,null,null,null,null,null,"BOYS 10 SINGLES"]
["Week of",null,null,null,"Venue",null,null,null,null,"Tour. Director",null,null,null,null,null,null,"TUATT Referee"]
[{"$f":"'[1]Week SetUp'!$A$10","v":"5th - 11th July 2015"},null,null,null,{"$f":"'[1]Week SetUp'!$C$10","v":"Eddie Tayor Public Courts, Nelson Mandela Park"},null,null,null,null,{"$f":"'[1]Week SetUp'!$A$12","v":"Anthony Sanchez"},null,null,null,null,null,null,{"$f":"'[1]Week SetUp'!$E$10","v":"Colleen De Gannes / Edwin Chu For"}]
[null,"St.","Rank","Seed","Family Name","First name",null,"Nationality",null,"Semifinals",null,"Final",null,"Winner"]
[]
[1,{"$f":"IF($D7=\"\",\"\",VLOOKUP($D7,'[1]Boys 10 Si Main Draw Prep'!$A$7:$P$22,15))","v":0},{"$f":"IF($D7=\"\",\"\",VLOOKUP($D7,'[1]Boys 10 Si Main Draw Prep'!$A$7:$P$22,16))","v":0},1,{"$f":"UPPER(IF($D7=\"\",\"\",VLOOKUP($D7,'[1]Boys 10 Si Main Draw Prep'!$A$7:$P$22,2)))","v":"SYLVESTER"},{"$f":"IF($D7=\"\",\"\",VLOOKUP($D7,'[1]Boys 10 Si Main Draw Prep'!$A$7:$P$22,3))","v":"Beckham"},null,{"$f":"IF($D7=\"\",\"\",VLOOKUP($D7,'[1]Boys 10 Si Main Draw Prep'!$A$7:$P$22,4))","v":0},null,null,null,null,null,null,null,null,null,null,null,{"$f":"'[1]SetUp Officials'!P21","v":"Umpire"}]
[null,null,null,null,null,null,null,"Umpire","AS",{"$f":"UPPER(IF(OR(I8=\"a\",I8=\"as\"),E7,IF(OR(I8=\"b\",I8=\"bs\"),E9,)))","v":"SYLVESTER"},null,null,null,null,null,null,null,null,null,{"$f":"'[1]SetUp Officials'!P22","v":" "}]
[2,{"$f":"IF($D9=\"\",\"\",VLOOKUP($D9,'[1]Boys 10 Si Main Draw Prep'!$A$7:$P$22,15))","v":0},{"$f":"IF($D9=\"\",\"\",VLOOKUP($D9,'[1]Boys 10 Si Main Draw Prep'!$A$7:$P$22,16))","v":0},6,{"$f":"UPPER(IF($D9=\"\",\"\",VLOOKUP($D9,'[1]Boys 10 Si Main Draw Prep'!$A$7:$P$22,2)))","v":"MITCHELL "},{"$f":"IF($D9=\"\",\"\",VLOOKUP($D9,'[1]Boys 10 Si Main Draw Prep'!$A$7:$P$22,3))","v":"Jayden"},null,{"$f":"IF($D9=\"\",\"\",VLOOKUP($D9,'[1]Boys 10 Si Main Draw Prep'!$A$7:$P$22,4))","v":0},null,"W/O",null,null,null,null,null,null,null,null,null,{"$f":"'[1]SetUp Officials'!P23","v":" "}]
[null,null,null,null,null,null,null,null,null,"Umpire","AS",{"$f":"UPPER(IF(OR(K10=\"a\",K10=\"as\"),J8,IF(OR(K10=\"b\",K10=\"bs\"),J12,)))","v":"SYLVESTER"},null,null,null,null,null,null,null,{"$f":"'[1]SetUp Officials'!P24","v":" "}]
{"$rows_left_out":22}
{"sheet":"Girls 10 Si Main","index":1,"n_rows":31,"n_cols":20,"rows_kept":31,"cut":false,"hidden":false,"merged":[[3,0,3,2]]}
[{"$f":"'[1]Week SetUp'!$A$6","v":"Sagicor Junior Tennis Tournament 2015"},null,null,null,null,null,null,null,null,null,null,null,null,""]
[null,null,null,null,null,null,null,null,null,"GIRLS 10 SINGLES"]
["Week of",null,null,null,null,"Venue",null,null,null,null,null,"Tour. Director",null,null,null,null,"ITF Referee"]
[{"$f":"'[1]Week SetUp'!$A$10","v":"5th - 11th July 2015"},null,null,null,null,{"$f":"'[1]Week SetUp'!$C$10","v":"Eddie Tayor Public Courts, Nelson Mandela Park"},null,null,null,{"$f":"'[1]Week SetUp'!$D$10","v":0},null,{"$f":"'[1]Week SetUp'!$A$12","v":"Anthony Sanchez"},null,null,null,null,{"$f":"'[1]Week SetUp'!$E$10","v":"Colleen De Gannes / Edwin Chu For"}]
[null,"St.","Rank","Seed","Family Name","First name",null,"Nationality",null,"Semifinals",null,"Final",null,"Winner"]
[]
[1,{"$f":"IF($D7=\"\",\"\",VLOOKUP($D7,'[1]Girls 10 Si Main Draw Prep'!$A$7:$P$22,15))","v":0},{"$f":"IF($D7=\"\",\"\",VLOOKUP($D7,'[1]Girls 10 Si Main Draw Prep'!$A$7:$P$22,16))","v":0},1,{"$f":"UPPER(IF($D7=\"\",\"\",VLOOKUP($D7,'[1]Girls 10 Si Main Draw Prep'!$A$7:$P$22,2)))","v":"WONG"},{"$f":"IF($D7=\"\",\"\",VLOOKUP($D7,'[1]Girls 10 Si Main Draw Prep'!$A$7:$P$22,3))","v":"Cameron"},null,{"$f":"IF($D7=\"\",\"\",VLOOKUP($D7,'[1]Girls 10 Si Main Draw Prep'!$A$7:$P$22,4))","v":0},null,null,null,null,null,null,null,null,null,null,null,{"$f":"'[1]SetUp Officials'!P21","v":"Umpire"}]
[null,null,null,null,null,null,null,"Umpire","AS",{"$f":"UPPER(IF(OR(I8=\"a\",I8=\"as\"),E7,IF(OR(I8=\"b\",I8=\"bs\"),E9,)))","v":"WONG"},null,null,null,null,null,null,null,null,null,{"$f":"'[1]SetUp Officials'!P22","v":" "}]
[2,{"$f":"IF($D9=\"\",\"\",VLOOKUP($D9,'[1]Girls 10 Si Main Draw Prep'!$A$7:$P$22,15))","v":0},{"$f":"IF($D9=\"\",\"\",VLOOKUP($D9,'[1]Girls 10 Si Main Draw Prep'!$A$7:$P$22,16))","v":0},7,{"$f":"UPPER(IF($D9=\"\",\"\",VLOOKUP($D9,'[1]Girls 10 Si Main Draw Prep'!$A$7:$P$22,2)))","v":"BYE"},{"$f":"IF($D9=\"\",\"\",VLOOKUP($D9,'[1]Girls 10 Si Main Draw Prep'!$A$7:$P$22,3))","v":0},null,{"$f":"IF($D9=\"\",\"\",VLOOKUP($D9,'[1]Girls 10 Si Main Draw Prep'!$A$7:$P$22,4))","v":0},null,null,null,null,null,null,null,null,null,null,null,{"$f":"'[1]SetUp Officials'!P23","v":" "}]
[null,null,null,null,null,null,null,null,null,"Umpire","AS",{"$f":"UPPER(IF(OR(K10=\"a\",K10=\"as\"),J8,IF(OR(K10=\"b\",K10=\"bs\"),J12,)))","v":"WONG"},null,null,null,null,null,null,null,{"$f":"'[1]SetUp Officials'!P24","v":" "}]
{"$rows_left_out":22}
{"sheet":"Boys 12 Si MD","index":2,"n_rows":47,"n_cols":20,"rows_kept":47,"cut":false,"hidden":false,"merged":[[3,0,3,2]]}
[{"$f":"'[1]Week SetUp'!$A$6","v":"Sagicor Junior Tennis Tournament 2015"},null,null,null,null,null,null,null,null,null,null,null,null,""]
[null,null,null,null,null,null,null,null,null,"BOYS 12 MAIN DRAW"]
["Week of",null,null,null,null,"Venue",null,null,null,null,null,"Tour. Director",null,null,null,null,"TUATT Referee"]
[{"$f":"'[1]Week SetUp'!$A$10","v":"5th - 11th July 2015"},null,null,null,null,{"$f":"'[1]Week SetUp'!$C$10","v":"Eddie Tayor Public Courts, Nelson Mandela Park"},null,null,null,{"$f":"'[1]Week SetUp'!$D$10","v":0},null,{"$f":"'[1]Week SetUp'!$A$12","v":"Anthony Sanchez"},null,null,null,null,{"$f":"'[1]Week SetUp'!$E$10","v":"Colleen De Gannes / Edwin Chu For"}]
[null,"St.","Rank","Seed","Family Name","First name",null,"Nationality",null,"Quarterfinals",null,"Semifinals",null,"Finals",null,"Winner"]
[]
[1,{"$f":"IF($D7=\"\",\"\",VLOOKUP($D7,'[1]Boys 10 Si MD Prep'!$A$7:$P$30,15))","v":0},{"$f":"IF($D7=\"\",\"\",VLOOKUP($D7,'[1]Boys 10 Si MD Prep'!$A$7:$P$30,16))","v":0},1,{"$f":"UPPER(IF($D7=\"\",\"\",VLOOKUP($D7,'[1]Boys 10 Si MD Prep'!$A$7:$P$30,2)))","v":"SHEPPARD"},{"$f":"IF($D7=\"\",\"\",VLOOKUP($D7,'[1]Boys 10 Si MD Prep'!$A$7:$P$30,3))","v":"Liam"},null,{"$f":"IF($D7=\"\",\"\",VLOOKUP($D7,'[1]Boys 10 Si MD Prep'!$A$7:$P$30,4))","v":0},null,null,null,null,null,null,null,null,null,null,null,{"$f":"'[1]SetUp Officials'!P21","v":"Umpire"}]
[null,null,null,null,null,null,null,null,"as",{"$f":"UPPER(IF(OR(I8=\"a\",I8=\"as\"),E7,IF(OR(I8=\"b\",I8=\"bs\"),E9,)))","v":"SHEPPARD"},null,null,null,null,null,null,null,null,null,{"$f":"'[1]SetUp Officials'!P22","v":" "}]
[2,{"$f":"IF($D9=\"\",\"\",VLOOKUP($D9,'[1]Boys 10 Si MD Prep'!$A$7:$P$30,15))","v":""},{"$f":"IF($D9=\"\",\"\",VLOOKUP($D9,'[1]Boys 10 Si MD Prep'!$A$7:$P$30,16))","v":""},null,"BYE",{"$f":"IF($D9=\"\",\"\",VLOOKUP($D9,'[1]Boys 10 Si MD Prep'!$A$7:$P$30,3))","v":""},null,{"$f":"IF($D9=\"\",\"\",VLOOKUP($D9,'[1]Boys 10 Si MD Prep'!$A$7:$P$30,4))","v":""},null,null,null,null,null,null,null,null,null,null,null,{"$f":"'[1]SetUp Officials'!P23","v":" "}]
[null,null,null,null,null,null,null,null,null,"Umpire","AS",{"$f":"UPPER(IF(OR(K10=\"a\",K10=\"as\"),J8,IF(OR(K10=\"b\",K10=\"bs\"),J12,)))","v":"SHEPPARD"},null,null,null,null,null,null,null,{"$f":"'[1]SetUp Officials'!P24","v":" "}]
{"$rows_left_out":38}
{"sheet":"Girls 12 Si MD","index":3,"n_rows":31,"n_cols":20,"rows_kept":31,"cut":false,"hidden":false,"merged":[[3,0,3,2]]}
[{"$f":"'[1]Week SetUp'!$A$6","v":"Sagicor Junior Tennis Tournament 2015"},null,null,null,null,null,null,null,null,null,null,null,null,""]
[null,null,null,null,null,null,null,null,null,"GIRLS 12 MAIN DRAW"]
["Week of",null,null,null,null,"Venue",null,null,null,null,null,"Tour. Director",null,null,null,null,"TUATT Referee"]
[{"$f":"'[1]Week SetUp'!$A$10","v":"5th - 11th July 2015"},null,null,null,null,{"$f":"'[1]Week SetUp'!$C$10","v":"Eddie Tayor Public Courts, Nelson Mandela Park"},null,null,null,{"$f":"'[1]Week SetUp'!$D$10","v":0},null,{"$f":"'[1]Week SetUp'!$A$12","v":"Anthony Sanchez"},null,null,null,null,{"$f":"'[1]Week SetUp'!$E$10","v":"Colleen De Gannes / Edwin Chu For"}]
[null,"St.","Rank","Seed","Family Name","First name",null,"Nationality",null,"Semifinals",null,"Finals",null,"Winner"]
[]
[1,{"$f":"IF($D7=\"\",\"\",VLOOKUP($D7,'[1]Girls 12 Si MD Draw Prep'!$A$7:$P$22,15))","v":0},{"$f":"IF($D7=\"\",\"\",VLOOKUP($D7,'[1]Girls 12 Si MD Draw Prep'!$A$7:$P$22,16))","v":0},1,{"$f":"UPPER(IF($D7=\"\",\"\",VLOOKUP($D7,'[1]Girls 12 Si MD Draw Prep'!$A$7:$P$22,2)))","v":"LAWRENCE"},{"$f":"IF($D7=\"\",\"\",VLOOKUP($D7,'[1]Girls 12 Si MD Draw Prep'!$A$7:$P$22,3))","v":"Emily"},null,{"$f":"IF($D7=\"\",\"\",VLOOKUP($D7,'[1]Girls 12 Si MD Draw Prep'!$A$7:$P$22,4))","v":0},null,null,null,null,null,null,null,null,null,null,null,{"$f":"'[1]SetUp Officials'!P21","v":"Umpire"}]
[null,null,null,null,null,null,null,"Umpire","AS",{"$f":"UPPER(IF(OR(I8=\"a\",I8=\"as\"),E7,IF(OR(I8=\"b\",I8=\"bs\"),E9,)))","v":"LAWRENCE"},null,null,null,null,null,null,null,null,null,{"$f":"'[1]SetUp Officials'!P22","v":" "}]
[2,{"$f":"IF($D9=\"\",\"\",VLOOKUP($D9,'[1]Girls 12 Si MD Draw Prep'!$A$7:$P$22,15))","v":0},{"$f":"IF($D9=\"\",\"\",VLOOKUP($D9,'[1]Girls 12 Si MD Draw Prep'!$A$7:$P$22,16))","v":0},7,{"$f":"UPPER(IF($D9=\"\",\"\",VLOOKUP($D9,'[1]Girls 12 Si MD Draw Prep'!$A$7:$P$22,2)))","v":"BYE"},{"$f":"IF($D9=\"\",\"\",VLOOKUP($D9,'[1]Girls 12 Si MD Draw Prep'!$A$7:$P$22,3))","v":0},null,{"$f":"IF($D9=\"\",\"\",VLOOKUP($D9,'[1]Girls 12 Si MD Draw Prep'!$A$7:$P$22,4))","v":0},null,null,null,null,null,null,null,null,null,null,null,{"$f":"'[1]SetUp Officials'!P23","v":" "}]
[null,null,null,null,null,null,null,null,null,"Umpire","AS",{"$f":"UPPER(IF(OR(K10=\"a\",K10=\"as\"),J8,IF(OR(K10=\"b\",K10=\"bs\"),J12,)))","v":"LAWRENCE"},null,null,null,null,null,null,null,{"$f":"'[1]SetUp Officials'!P24","v":" "}]
{"$rows_left_out":22}
{"sheet":"Boys 14 Si Main","index":4,"n_rows":31,"n_cols":20,"rows_kept":31,"cut":false,"hidden":false,"merged":[[3,0,3,2]]}
[{"$f":"'[2]Week SetUp'!$A$6","v":"Sagicor Junior Tennis Tournament 2015"},null,null,null,null,null,null,null,null,null,null,null,null,""]
[null,null,null,null,null,null,null,null,null,"BOYS 14 MAIN DRAW SINGLES"]
["Week of",null,null,null,null,"Venue",null,null,null,null,null,"Tour. Director",null,null,null,null,"TUATT Referee"]
[{"$f":"'[2]Week SetUp'!$A$10","v":"5th  - 11th July 2015"},null,null,null,null,{"$f":"'[2]Week SetUp'!$C$10","v":"Eddie Taylor Public Courts, Nelson Mandela Park"},null,null,null,{"$f":"'[2]Week SetUp'!$D$10","v":0},null,{"$f":"'[2]Week SetUp'!$A$12","v":"Anthony Sanchez"},null,null,null,null,{"$f":"'[2]Week SetUp'!$E$10","v":"Colleen De Gannes / Edwin Chu For"}]
[null,"St.","Rank","Seed","Family Name","First name",null,"Nationality",null,"2nd Round",null,"Semifinals",null,"Final",null,"Winner"]
[]
[1,{"$f":"IF($D7=\"\",\"\",VLOOKUP($D7,'[2]Boys 14 Si Main Draw Prep'!$A$7:$P$22,15))","v":0},{"$f":"IF($D7=\"\",\"\",VLOOKUP($D7,'[2]Boys 14 Si Main Draw Prep'!$A$7:$P$22,16))","v":0},1,{"$f":"UPPER(IF($D7=\"\",\"\",VLOOKUP($D7,'[2]Boys 14 Si Main Draw Prep'!$A$7:$P$22,2)))","v":"LAQUIS"},{"$f":"IF($D7=\"\",\"\",VLOOKUP($D7,'[2]Boys 14 Si Main Draw Prep'!$A$7:$P$22,3))","v":"Edward"},null,{"$f":"IF($D7=\"\",\"\",VLOOKUP($D7,'[2]Boys 14 Si Main Draw Prep'!$A$7:$P$22,4))","v":0},null,null,null,null,null,null,null,null,null,null,null,{"$f":"'[2]SetUp Officials'!P21","v":"Umpire"}]
[null,null,null,null,null,null,null,"Umpire","AS",{"$f":"UPPER(IF(OR(I8=\"a\",I8=\"as\"),E7,IF(OR(I8=\"b\",I8=\"bs\"),E9,)))","v":"LAQUIS"},null,null,null,null,null,null,null,null,null,{"$f":"'[2]SetUp Officials'!P22","v":" "}]
[2,{"$f":"IF($D9=\"\",\"\",VLOOKUP($D9,'[2]Boys 14 Si Main Draw Prep'!$A$7:$P$22,15))","v":""},{"$f":"IF($D9=\"\",\"\",VLOOKUP($D9,'[2]Boys 14 Si Main Draw Prep'!$A$7:$P$22,16))","v":""},null,"BYE",{"$f":"IF($D9=\"\",\"\",VLOOKUP($D9,'[2]Boys 14 Si Main Draw Prep'!$A$7:$P$22,3))","v":""},null,{"$f":"IF($D9=\"\",\"\",VLOOKUP($D9,'[2]Boys 14 Si Main Draw Prep'!$A$7:$P$22,4))","v":""},null,null,null,null,null,null,null,null,null,null,null,{"$f":"'[2]SetUp Officials'!P23","v":" "}]
[null,null,null,null,null,null,null,null,null,"Umpire","B",{"$f":"UPPER(IF(OR(K10=\"a\",K10=\"as\"),J8,IF(OR(K10=\"b\",K10=\"bs\"),J12,)))","v":"ALEXIS"},null,null,null,null,null,null,null,{"$f":"'[2]SetUp Officials'!P24","v":" "}]
{"$rows_left_out":22}
{"sheet":"Girls 14 Si Main","index":5,"n_rows":31,"n_cols":20,"rows_kept":31,"cut":false,"hidden":false,"merged":[[3,0,3,2]]}
[{"$f":"'[2]Week SetUp'!$A$6","v":"Sagicor Junior Tennis Tournament 2015"},null,null,null,null,null,null,null,null,null,null,null,null,""]
[null,null,null,null,null,null,null,null,null,"GIRLS 14 MAIN DRAW SINGLES"]
["Week of",null,null,null,null,"Venue",null,null,null,null,null,"COTECC Supervisor",null,null,null,null,"TUATT Referee"]
[{"$f":"'[2]Week SetUp'!$A$10","v":"5th  - 11th July 2015"},null,null,null,null,{"$f":"'[2]Week SetUp'!$C$10","v":"Eddie Taylor Public Courts, Nelson Mandela Park"},null,null,null,{"$f":"'[2]Week SetUp'!$D$10","v":0},null,{"$f":"'[2]Week SetUp'!$A$12","v":"Anthony Sanchez"},null,null,null,null,{"$f":"'[2]Week SetUp'!$E$10","v":"Colleen De Gannes / Edwin Chu For"}]
[null,"St.","Rank","Seed","Family Name","First name",null,"Nationality",null,"Semifinals",null,"Final",null,"Winner",null,"Winner"]
[]
[1,{"$f":"IF($D7=\"\",\"\",VLOOKUP($D7,'[2]Girls 14 Si Main Draw Prep'!$A$7:$P$22,15))","v":0},{"$f":"IF($D7=\"\",\"\",VLOOKUP($D7,'[2]Girls 14 Si Main Draw Prep'!$A$7:$P$22,16))","v":0},1,{"$f":"UPPER(IF($D7=\"\",\"\",VLOOKUP($D7,'[2]Girls 14 Si Main Draw Prep'!$A$7:$P$22,2)))","v":"KOYLASS"},{"$f":"IF($D7=\"\",\"\",VLOOKUP($D7,'[2]Girls 14 Si Main Draw Prep'!$A$7:$P$22,3))","v":"Victoria"},null,{"$f":"IF($D7=\"\",\"\",VLOOKUP($D7,'[2]Girls 14 Si Main Draw Prep'!$A$7:$P$22,4))","v":0},null,null,null,null,null,null,null,null,null,null,null,{"$f":"'[2]SetUp Officials'!P21","v":"Umpire"}]
[null,null,null,null,null,null,null,"Umpire","AS",{"$f":"UPPER(IF(OR(I8=\"a\",I8=\"as\"),E7,IF(OR(I8=\"b\",I8=\"bs\"),E9,)))","v":"KOYLASS"},null,null,null,null,null,null,null,null,null,{"$f":"'[2]SetUp Officials'!P22","v":" "}]
[2,{"$f":"IF($D9=\"\",\"\",VLOOKUP($D9,'[2]Girls 14 Si Main Draw Prep'!$A$7:$P$22,15))","v":0},{"$f":"IF($D9=\"\",\"\",VLOOKUP($D9,'[2]Girls 14 Si Main Draw Prep'!$A$7:$P$22,16))","v":0},7,{"$f":"UPPER(IF($D9=\"\",\"\",VLOOKUP($D9,'[2]Girls 14 Si Main Draw Prep'!$A$7:$P$22,2)))","v":"MATA BREWER"},{"$f":"IF($D9=\"\",\"\",VLOOKUP($D9,'[2]Girls 14 Si Main Draw Prep'!$A$7:$P$22,3))","v":"Fabiana"},null,{"$f":"IF($D9=\"\",\"\",VLOOKUP($D9,'[2]Girls 14 Si Main Draw Prep'!$A$7:$P$22,4))","v":0},null,"60 61",null,null,null,null,null,null,null,null,null,{"$f":"'[2]SetUp Officials'!P23","v":" "}]
[null,null,null,null,null,null,null,null,null,"Umpire","AS",{"$f":"UPPER(IF(OR(K10=\"a\",K10=\"as\"),J8,IF(OR(K10=\"b\",K10=\"bs\"),J12,)))","v":"KOYLASS"},null,null,null,null,null,null,null,{"$f":"'[2]SetUp Officials'!P24","v":" "}]
{"$rows_left_out":22}
{"sheet":"Boys 16 Si Main","index":6,"n_rows":31,"n_cols":20,"rows_kept":31,"cut":false,"hidden":false,"merged":[[3,0,3,2]]}
[{"$f":"'[3]Week SetUp'!$A$6","v":"Sagicor Junior Tennis Tournament 2015"},null,null,null,null,null,null,null,null,null,null,null,null,""]
[null,null,null,null,null,null,null,null,null,"BOYS 16 MAIN DRAW"]
["Week of",null,null,null,null,"Venue",null,null,null,null,null,"Tour. Director",null,null,null,null,"TUATT Referee"]
[{"$f":"'[3]Week SetUp'!$A$10","v":"5th - 11th July 2015"},null,null,null,null,{"$f":"'[3]Week SetUp'!$C$10","v":"Eddie Tayor Public Courts, Nelson Mandela Park"},null,null,null,null,null,{"$f":"'[3]Week SetUp'!$A$12","v":"Anthony Sanchez"},null,null,null,null,{"$f":"'[3]Week SetUp'!$E$10","v":"Colleen De Gannes / Edwin Chu For"}]
[null,"St.","Rank","Seed","Family Name","First name",null,"Nationality",null,"Semifinals",null,"Final",null,"Winner"]
[]
[1,{"$f":"IF($D7=\"\",\"\",VLOOKUP($D7,'[3]Boys 16 Si Main Draw Prep'!$A$7:$P$22,15))","v":0},{"$f":"IF($D7=\"\",\"\",VLOOKUP($D7,'[3]Boys 16 Si Main Draw Prep'!$A$7:$P$22,16))","v":0},1,{"$f":"UPPER(IF($D7=\"\",\"\",VLOOKUP($D7,'[3]Boys 16 Si Main Draw Prep'!$A$7:$P$22,2)))","v":"MCLAUGHLIN-VANLOW"},{"$f":"IF($D7=\"\",\"\",VLOOKUP($D7,'[3]Boys 16 Si Main Draw Prep'!$A$7:$P$22,3))","v":"Kaelan"},null,{"$f":"IF($D7=\"\",\"\",VLOOKUP($D7,'[3]Boys 16 Si Main Draw Prep'!$A$7:$P$22,4))","v":0},null,null,null,null,null,null,null,null,null,null,null,{"$f":"'[3]SetUp Officials'!P21","v":"Umpire"}]
[null,null,null,null,null,null,null,"Umpire","as",{"$f":"UPPER(IF(OR(I8=\"a\",I8=\"as\"),E7,IF(OR(I8=\"b\",I8=\"bs\"),E9,)))","v":"MCLAUGHLIN-VANLOW"},null,null,null,null,null,null,null,null,null,{"$f":"'[3]SetUp Officials'!P22","v":" "}]
[2,{"$f":"IF($D9=\"\",\"\",VLOOKUP($D9,'[3]Boys 16 Si Main Draw Prep'!$A$7:$P$22,15))","v":0},{"$f":"IF($D9=\"\",\"\",VLOOKUP($D9,'[3]Boys 16 Si Main Draw Prep'!$A$7:$P$22,16))","v":0},7,{"$f":"UPPER(IF($D9=\"\",\"\",VLOOKUP($D9,'[3]Boys 16 Si Main Draw Prep'!$A$7:$P$22,2)))","v":"BYE"},{"$f":"IF($D9=\"\",\"\",VLOOKUP($D9,'[3]Boys 16 Si Main Draw Prep'!$A$7:$P$22,3))","v":0},null,{"$f":"IF($D9=\"\",\"\",VLOOKUP($D9,'[3]Boys 16 Si Main Draw Prep'!$A$7:$P$22,4))","v":0},null,null,null,null,null,null,null,null,null,null,null,{"$f":"'[3]SetUp Officials'!P23","v":" "}]
[null,null,null,null,null,null,null,null,null,"Umpire","b",{"$f":"UPPER(IF(OR(K10=\"a\",K10=\"as\"),J8,IF(OR(K10=\"b\",K10=\"bs\"),J12,)))","v":"CARTER"},null,null,null,null,null,null,null,{"$f":"'[3]SetUp Officials'!P24","v":" "}]
{"$rows_left_out":22}
{"sheet":"Girls Si Main 16","index":7,"n_rows":23,"n_cols":20,"rows_kept":23,"cut":false,"hidden":false,"merged":[[3,0,3,2]]}
[{"$f":"'[3]Week SetUp'!$A$6","v":"Sagicor Junior Tennis Tournament 2015"},null,null,null,null,null,null,null,null,null,null,null,null,""]
[null,null,null,null,null,null,null,null,null,"GIRLS 16 MAIN DRAW SINGLES"]
["Week of",null,null,null,null,"Venue",null,null,null,null,null,"Tour. Director",null,null,null,null,"TUATT Referee"]
[{"$f":"'[3]Week SetUp'!$A$10","v":"5th - 11th July 2015"},null,null,null,null,{"$f":"'[3]Week SetUp'!$C$10","v":"Eddie Tayor Public Courts, Nelson Mandela Park"},null,null,null,null,null,{"$f":"'[3]Week SetUp'!$A$12","v":"Anthony Sanchez"},null,null,null,null,{"$f":"'[3]Week SetUp'!$E$10","v":"Colleen De Gannes / Edwin Chu For"}]
[null,"St.","Rank","Seed","Family Name","First name",null,"Nationality",null,"Final",null,"Winner"]
[]
[1,{"$f":"IF($D7=\"\",\"\",VLOOKUP($D7,'[3]Girls Si Main Draw Prep'!$A$7:$P$22,15))","v":0},{"$f":"IF($D7=\"\",\"\",VLOOKUP($D7,'[3]Girls Si Main Draw Prep'!$A$7:$P$22,16))","v":0},1,{"$f":"UPPER(IF($D7=\"\",\"\",VLOOKUP($D7,'[3]Girls Si Main Draw Prep'!$A$7:$P$22,2)))","v":"TOM YEW"},{"$f":"IF($D7=\"\",\"\",VLOOKUP($D7,'[3]Girls Si Main Draw Prep'!$A$7:$P$22,3))","v":"Jade"},null,{"$f":"IF($D7=\"\",\"\",VLOOKUP($D7,'[3]Girls Si Main Draw Prep'!$A$7:$P$22,4))","v":0},null,null,null,null,null,null,null,null,null,null,null,{"$f":"'[3]SetUp Officials'!P21","v":"Umpire"}]
[null,null,null,null,null,null,null,"Umpire","AS",{"$f":"UPPER(IF(OR(I8=\"a\",I8=\"as\"),E7,IF(OR(I8=\"b\",I8=\"bs\"),E9,)))","v":"TOM YEW"},null,null,null,null,null,null,null,null,null,{"$f":"'[3]SetUp Officials'!P22","v":" "}]
[2,{"$f":"IF($D9=\"\",\"\",VLOOKUP($D9,'[3]Girls Si Main Draw Prep'!$A$7:$P$22,15))","v":0},{"$f":"IF($D9=\"\",\"\",VLOOKUP($D9,'[3]Girls Si Main Draw Prep'!$A$7:$P$22,16))","v":0},4,{"$f":"UPPER(IF($D9=\"\",\"\",VLOOKUP($D9,'[3]Girls Si Main Draw Prep'!$A$7:$P$22,2)))","v":"WHITTIER"},{"$f":"IF($D9=\"\",\"\",VLOOKUP($D9,'[3]Girls Si Main Draw Prep'!$A$7:$P$22,3))","v":"Aura"},null,{"$f":"IF($D9=\"\",\"\",VLOOKUP($D9,'[3]Girls Si Main Draw Prep'!$A$7:$P$22,4))","v":0},null,"61 61",null,null,null,null,null,null,null,null,null,{"$f":"'[3]SetUp Officials'!P23","v":" "}]
[null,null,null,null,null,null,null,null,null,"Umpire","AS",{"$f":"UPPER(IF(OR(K10=\"a\",K10=\"as\"),J8,IF(OR(K10=\"b\",K10=\"bs\"),J12,)))","v":"TOM YEW"},null,null,null,null,null,null,null,{"$f":"'[3]SetUp Officials'!P24","v":" "}]
{"$rows_left_out":14}
{"sheet":"Boys 18 Si Main","index":8,"n_rows":31,"n_cols":20,"rows_kept":31,"cut":false,"hidden":false,"merged":[[3,0,3,2]]}
[{"$f":"'[4]Week SetUp'!$A$6","v":"Sagicor Junior Tennis Tournament 2015"},null,null,null,null,null,null,null,null,null,null,null,null,""]
[null,null,null,null,null,null,null,null,null,"BOYS 18 MAIN DRAW SINGLES"]
["Week of",null,null,null,null,"Venue",null,null,null,null,null,"Tour. Director",null,null,null,null,"TUATT Referee"]
[{"$f":"'[4]Week SetUp'!$A$10","v":"5th - 11th July 2015"},null,null,null,null,{"$f":"'[4]Week SetUp'!$C$10","v":"Eddie Tayor Public courts"},null,null,null,null,null,{"$f":"'[4]Week SetUp'!$A$12","v":"Anthony Sanchez"},null,null,null,null,{"$f":"'[4]Week SetUp'!$E$10","v":"Colleen De Gannes / Edwin Chu For"}]
[null,"St.","Rank","Seed","Family Name","First name",null,"Nationality",null,"2nd Round",null,"Semifinals",null,"Final",null,"Winner"]
[]
[1,{"$f":"IF($D7=\"\",\"\",VLOOKUP($D7,'[4]Boys 18 Si Main Draw Prep'!$A$7:$P$22,15))","v":0},{"$f":"IF($D7=\"\",\"\",VLOOKUP($D7,'[4]Boys 18 Si Main Draw Prep'!$A$7:$P$22,16))","v":0},1,{"$f":"UPPER(IF($D7=\"\",\"\",VLOOKUP($D7,'[4]Boys 18 Si Main Draw Prep'!$A$7:$P$22,2)))","v":"MOHAMMED"},{"$f":"IF($D7=\"\",\"\",VLOOKUP($D7,'[4]Boys 18 Si Main Draw Prep'!$A$7:$P$22,3))","v":"Nabeel"},null,{"$f":"IF($D7=\"\",\"\",VLOOKUP($D7,'[4]Boys 18 Si Main Draw Prep'!$A$7:$P$22,4))","v":0},null,null,null,null,null,null,null,null,null,null,null,{"$f":"'[4]SetUp Officials'!P21","v":"Umpire"}]
[null,null,null,null,null,null,null,"Umpire","B",{"$f":"UPPER(IF(OR(I8=\"a\",I8=\"as\"),E7,IF(OR(I8=\"b\",I8=\"bs\"),E9,)))","v":"GREGOIRE"},null,null,null,null,null,null,null,null,null,{"$f":"'[4]SetUp Officials'!P22","v":" "}]
[2,{"$f":"IF($D9=\"\",\"\",VLOOKUP($D9,'[4]Boys 18 Si Main Draw Prep'!$A$7:$P$22,15))","v":0},{"$f":"IF($D9=\"\",\"\",VLOOKUP($D9,'[4]Boys 18 Si Main Draw Prep'!$A$7:$P$22,16))","v":0},5,{"$f":"UPPER(IF($D9=\"\",\"\",VLOOKUP($D9,'[4]Boys 18 Si Main Draw Prep'!$A$7:$P$22,2)))","v":"GREGOIRE"},{"$f":"IF($D9=\"\",\"\",VLOOKUP($D9,'[4]Boys 18 Si Main Draw Prep'!$A$7:$P$22,3))","v":"Brandon"},null,{"$f":"IF($D9=\"\",\"\",VLOOKUP($D9,'[4]Boys 18 Si Main Draw Prep'!$A$7:$P$22,4))","v":0},null,"16V64 [12 - 10]",null,null,null,null,null,null,null,null,null,{"$f":"'[4]SetUp Officials'!P23","v":" "}]
[null,null,null,null,null,null,null,null,null,"Umpire","b",{"$f":"UPPER(IF(OR(K10=\"a\",K10=\"as\"),J8,IF(OR(K10=\"b\",K10=\"bs\"),J12,)))","v":"THOMAS"},null,null,null,null,null,null,null,{"$f":"'[4]SetUp Officials'!P24","v":" "}]
{"$rows_left_out":22}
{"sheet":"Girls 18 Si Main","index":9,"n_rows":23,"n_cols":20,"rows_kept":23,"cut":false,"hidden":false,"merged":[[3,0,3,2]]}
[{"$f":"'[4]Week SetUp'!$A$6","v":"Sagicor Junior Tennis Tournament 2015"},null,null,null,null,null,null,null,null,null,null,null,null,""]
[null,null,null,null,null,null,null,null,null,"GIRLS 18 SINGLES MAIN DRAW"]
["Week of",null,null,null,null,"Venue",null,null,null,null,null,"Tour. Director",null,null,null,null,"TUATT Referee"]
[{"$f":"'[4]Week SetUp'!$A$10","v":"5th - 11th July 2015"},null,null,null,null,{"$f":"'[4]Week SetUp'!$C$10","v":"Eddie Tayor Public courts"},null,null,null,null,null,{"$f":"'[4]Week SetUp'!$A$12","v":"Anthony Sanchez"},null,null,null,null,{"$f":"'[4]Week SetUp'!$E$10","v":"Colleen De Gannes / Edwin Chu For"}]
[null,"St.","Rank","Seed","Family Name","First name",null,"Nationality",null,"Final",null,"Winner"]
[]
[1,{"$f":"IF($D7=\"\",\"\",VLOOKUP($D7,'[4]Girls 18 Si Main Draw Prep'!$A$7:$P$22,15))","v":0},{"$f":"IF($D7=\"\",\"\",VLOOKUP($D7,'[4]Girls 18 Si Main Draw Prep'!$A$7:$P$22,16))","v":0},1,{"$f":"UPPER(IF($D7=\"\",\"\",VLOOKUP($D7,'[4]Girls 18 Si Main Draw Prep'!$A$7:$P$22,2)))","v":"TRESTRAIL"},{"$f":"IF($D7=\"\",\"\",VLOOKUP($D7,'[4]Girls 18 Si Main Draw Prep'!$A$7:$P$22,3))","v":"Emma-Rose"},null,{"$f":"IF($D7=\"\",\"\",VLOOKUP($D7,'[4]Girls 18 Si Main Draw Prep'!$A$7:$P$22,4))","v":0},null,null,null,null,null,null,null,null,null,null,null,{"$f":"'[4]SetUp Officials'!P21","v":"Umpire"}]
[null,null,null,null,null,null,null,"Umpire","AS",{"$f":"UPPER(IF(OR(I8=\"a\",I8=\"as\"),E7,IF(OR(I8=\"b\",I8=\"bs\"),E9,)))","v":"TRESTRAIL"},null,null,null,null,null,null,null,null,null,{"$f":"'[4]SetUp Officials'!P22","v":" "}]
[2,{"$f":"IF($D9=\"\",\"\",VLOOKUP($D9,'[4]Girls 18 Si Main Draw Prep'!$A$7:$P$22,15))","v":0},{"$f":"IF($D9=\"\",\"\",VLOOKUP($D9,'[4]Girls 18 Si Main Draw Prep'!$A$7:$P$22,16))","v":0},4,{"$f":"UPPER(IF($D9=\"\",\"\",VLOOKUP($D9,'[4]Girls 18 Si Main Draw Prep'!$A$7:$P$22,2)))","v":"FITZWILLIAM"},{"$f":"IF($D9=\"\",\"\",VLOOKUP($D9,'[4]Girls 18 Si Main Draw Prep'!$A$7:$P$22,3))","v":"Salina"},null,{"$f":"IF($D9=\"\",\"\",VLOOKUP($D9,'[4]Girls 18 Si Main Draw Prep'!$A$7:$P$22,4))","v":0},null,"60 61",null,null,null,null,null,null,null,null,null,{"$f":"'[4]SetUp Officials'!P23","v":" "}]
[null,null,null,null,null,null,null,null,null,"Umpire","bs",{"$f":"UPPER(IF(OR(K10=\"a\",K10=\"as\"),J8,IF(OR(K10=\"b\",K10=\"bs\"),J12,)))","v":"DAVIS"},null,null,null,null,null,null,null,{"$f":"'[4]SetUp Officials'!P24","v":" "}]
{"$rows_left_out":13}